{"text_format":"1","workbook":"xlsx","n_sheets":5,"sheets":["resultaten","standenlijst","deelnemers","print.kopieren speciaal!!","uitleg"],"not_rendered":{"charts":0,"images":1,"macros":1,"external_links":0,"defined_names":6,"comments":0,"pivot_tables":0},"unopened":[],"bounds":{"document_bytes":16777216,"sheet_cells":100000,"rows_first":2000,"rows_last":500,"rows_between":2000,"halvings":0,"cell_chars":16384,"cell_head_chars":4096},"cells_cut":0,"cells_raw":0,"read":"whole","date_system":"1900"}

{"sheet":"resultaten","index":0,"n_rows":42,"n_cols":90,"rows_kept":42,"cut":false,"hidden":false,"merged":[]}
[null,null,null,"totaal","totb","totgem","hoog",null,"laag",1,2,3,4,5,6,7,8,9,10,11,12,13,14,15,16,17,18,19,20,21,22,23,24,25,26,27,28,29,30,31,32,33,34,35,36,37,38,39,40,41,42,43,44,45,46,47,48,49,50,51,52,53,54,55,56,57,58,59,60,61,null,null,null,null,1,2,3,4,5,6,7,8,9,10,11,12,13,14,15,"totaal 15B"]
["Datum:",null,null,null,null,null,null,null,null,"2023-03-29","2023-04-05","2023-04-08","9-4 hapert","2023-04-12","2023-04-19","2023-04-22","2023-04-26","2023-05-03","2023-05-06","2023-05-10","2023-05-17","2023-05-20","2023-05-24","2023-05-27","2023-05-29","2023-05-31","2023-06-04","2023-06-07","2023-06-10","2023-06-11","2023-06-14","2023-06-17","2023-06-21","2023-06-24","2023-06-28","2023-07-01","2023-07-05","2023-07-12","2023-07-19","2023-07-22","2023-07-26","2023-07-29","2023-08-02","2023-08-05","2023-08-09","2023-08-12","2023-08-16","2023-08-19","2023-08-23","2023-08-26","2023-08-30","2023-09-05","2023-09-06","2023-09-09","2023-09-10","2023-09-13","2023-09-16","2023-09-20","2023-09-23","2023-09-27"]
[null,1,{"$f":"VLOOKUP(B3,Naam,2,FALSE)","v":"Martien van Woerkum"},{"$f":"SUM($J3:$BR3)","v":239},{"$f":"COUNT($J3:$BR3)","v":37},{"$f":"IF(D3=0,0,ROUND(D3/E3,2))","v":6.46},{"$f":"MAX($J3:$AM3)","v":11},null,{"$f":"MIN($J3:$AM3)","v":3},6,null,null,null,null,9,null,7,5,4,5,8,8,null,4,6,null,6,4,9,4,9,6,null,null,11,3,null,10,8,null,8,7,3,null,null,6,9,6,null,13,8,3,3,9,7,4,5,9,2,5,null,null,null,null,null,null,null,null,null,null,null,null,null,null,{"$f":"IF(ISERROR(LARGE($J3:$BR3,BW$1)),\"\",LARGE($J3:$BR3,BW$1))","v":13},{"$f":"IF(ISERROR(LARGE($J3:$BR3,BX$1)),\"\",LARGE($J3:$BR3,BX$1))","v":11},10,9,9,9,9,9,9,8,8,8,8,8,7,{"$f":"IF(COUNT(BW3:CK3)=15,SUM(BW3:CK3),0)","v":135}]
[null,2,"Jack de Graaf",157,29,5.41,9,null,2,2,null,null,null,8,5,4,null,null,7,null,4,6,null,null,6,null,9,null,6,4,4,null,null,7,null,6,null,3,null,4,5,null,5,null,5,8,9,null,null,6,7,2,null,null,null,4,4,4,6,7,null,null,null,null,null,null,null,null,null,null,null,null,null,null,9,{"$f":"IF(ISERROR(LARGE($J4:$BR4,BX$1)),\"\",LARGE($J4:$BR4,BX$1))","v":9},8,8,7,7,7,7,6,6,6,6,6,6,5,103]
[null,3,"Nico Borgmans",13,2,6.5,8,null,5,null,null,null,null,null,null,null,null,null,null,null,null,null,null,null,8,null,null,5,null,null,null,null,null,null,null,null,null,null,null,null,null,null,null,null,null,null,null,null,null,null,null,null,null,null,null,null,null,null,null,null,null,null,null,null,null,null,null,null,null,null,null,null,null,null,8,{"$f":"IF(ISERROR(LARGE($J5:$BR5,BX$1)),\"\",LARGE($J5:$BR5,BX$1))","v":5},"","","","","","","","","","","","","",0]
[null,4,"Cees Brekelmans",178,25,7.12,11,null,5,null,null,11,null,6,10,null,null,9,10,null,null,7,null,null,11,null,null,7,null,5,6,7,8,null,5,6,8,null,null,null,8,null,3,null,11,null,null,7,null,4,8,4,null,null,7,4,null,6,null,null,null,null,null,null,null,null,null,null,null,null,null,null,null,null,11,{"$f":"IF(ISERROR(LARGE($J6:$BR6,BX$1)),\"\",LARGE($J6:$BR6,BX$1))","v":11},11,10,10,9,8,8,8,8,7,7,7,7,7,129]
[null,5,"Christ van Dongen",75,21,3.57,6,null,1,null,null,4,null,null,null,null,null,4,null,null,6,null,2,4,4,null,2,5,5,null,4,null,null,null,null,null,null,1,4,3,3,null,null,2,null,null,null,1,5,null,2,null,null,null,6,null,4,null,4,null,null,null,null,null,null,null,null,null,null,null,null,null,null,null,6,{"$f":"IF(ISERROR(LARGE($J7:$BR7,BX$1)),\"\",LARGE($J7:$BR7,BX$1))","v":6},5,5,5,4,4,4,4,4,4,4,4,3,3,65]
[null,6,"Ingrid van Dongen",0,0,0,0,null,0,null,null,null,null,null,null,null,null,null,null,null,null,null,null,null,null,null,null,null,null,null,null,null,null,null,null,null,null,null,null,null,null,null,null,null,null,null,null,null,null,null,null,null,null,null,null,null,null,null,null,null,null,null,null,null,null,null,null,null,null,null,null,null,null,null,"",{"$f":"IF(ISERROR(LARGE($J8:$BR8,BX$1)),\"\",LARGE($J8:$BR8,BX$1))","v":""},"","","","","","","","","","","","","",0]
[null,7,"Jeroen van Dongen",12,3,4,9,null,9,null,null,null,null,null,null,null,null,null,null,null,null,null,null,null,9,null,null,null,null,null,null,null,null,null,null,null,null,null,null,null,null,null,null,null,null,null,null,null,null,null,null,0,null,null,3,null,null,null,null,null,null,null,null,null,null,null,null,null,null,null,null,null,null,null,9,{"$f":"IF(ISERROR(LARGE($J9:$BR9,BX$1)),\"\",LARGE($J9:$BR9,BX$1))","v":3},0,"","","","","","","","","","","","",{"$f":"IF(COUNT(BW9:CK9)=15,SUM(BW9:CK9),0)","v":0}]
[null,8,"Dave Geysen",5,1,5,0,null,0,null,null,null,null,null,null,null,null,null,null,null,null,null,null,null,null,null,null,null,null,null,null,null,null,null,null,null,null,null,null,null,null,null,null,null,null,null,null,null,null,null,null,5,null,null,null,null,null,null,null,null,null,null,null,null,null,null,null,null,null,null,null,null,null,null,5,{"$f":"IF(ISERROR(LARGE($J10:$BR10,BX$1)),\"\",LARGE($J10:$BR10,BX$1))","v":""},"","","","","","","","","","","","","",0]
[null,9,"Gust Gijbels",93,10,9.3000000000000007,13,null,5,null,8,null,null,5,null,null,null,null,null,null,null,null,null,null,null,null,null,null,null,null,null,null,null,null,null,13,null,null,null,null,10,null,10,null,11,null,null,null,null,10,10,9,null,null,7,null,null,null,null,null,null,null,null,null,null,null,null,null,null,null,null,null,null,null,13,{"$f":"IF(ISERROR(LARGE($J11:$BR11,BX$1)),\"\",LARGE($J11:$BR11,BX$1))","v":11},10,10,10,10,9,8,7,5,"","","","","",0]
[null,10,"Jos Wouters",200,38,5.26,10,null,2,7,10,7,null,7,9,null,7,4,7,3,5,6,5,4,6,7,2,5,3,4,8,null,2,null,5,2,8,2,4,8,2,null,3,3,null,null,null,null,6,4,1,8,5,8,6,7,null,null,null,null,null,null,null,null,null,null,null,null,null,null,null,null,null,null,10,{"$f":"IF(ISERROR(LARGE($J12:$BR12,BX$1)),\"\",LARGE($J12:$BR12,BX$1))","v":9},8,8,8,8,8,7,7,7,7,7,7,7,6,114]
[null,11,"Wim van Rooij",266,39,6.82,10,null,3,4,4,3,null,10,6,null,8,5,5,9,9,7,8,4,3,4,null,null,null,null,9,null,5,6,4,4,null,7,8,1,8,null,null,null,9,12,9,9,7,10,9,10,5,7,10,5,null,8,6,9,null,null,null,null,null,null,null,null,null,null,null,null,null,null,12,{"$f":"IF(ISERROR(LARGE($J13:$BR13,BX$1)),\"\",LARGE($J13:$BR13,BX$1))","v":10},10,10,10,9,9,9,9,9,9,9,9,8,8,140]
[null,12,"Harry Kloppenburg",0,0,0,0,null,0,null,null,null,null,null,null,null,null,null,null,null,null,null,null,null,null,null,null,null,null,null,null,null,null,null,null,null,null,null,null,null,null,null,null,null,null,null,null,null,null,null,null,null,null,null,null,null,null,null,null,null,null,null,null,null,null,null,null,null,null,null,null,null,null,null,"",{"$f":"IF(ISERROR(LARGE($J14:$BR14,BX$1)),\"\",LARGE($J14:$BR14,BX$1))","v":""},"","","","","","","","","","","","","",0]
[null,13,"Olav Kruijssen",9,1,9,9,null,9,null,null,null,null,null,null,null,null,null,null,null,null,null,null,null,9,null,null,null,null,null,null,null,null,null,null,null,null,null,null,null,null,null,null,null,null,null,null,null,null,null,null,null,null,null,null,null,null,null,null,null,null,null,null,null,null,null,null,null,null,null,null,null,null,null,9,{"$f":"IF(ISERROR(LARGE($J15:$BR15,BX$1)),\"\",LARGE($J15:$BR15,BX$1))","v":""},"","","","","","","","","","","","","",0]
[null,14,"Bart de Laat",359,49,7.33,11,null,4,4,4,8,10,9,7,8,10,8,6,11,8,null,5,9,8,10,10,11,6,11,null,8,8,5,7,9,6,4,11,7,10,9,7,10,10,13,6,1,5,9,4,9,4,6,3,3,6,7,3,6,null,null,null,null,null,null,null,null,null,null,null,null,null,null,13,{"$f":"IF(ISERROR(LARGE($J16:$BR16,BX$1)),\"\",LARGE($J16:$BR16,BX$1))","v":11},11,11,11,10,10,10,10,10,10,10,9,9,9,154]
[null,15,"Sjaan Paridaans",0,0,0,0,null,0,null,null,null,null,null,null,null,null,null,null,null,null,null,null,null,null,null,null,null,null,null,null,null,null,null,null,null,null,null,null,null,null,null,null,null,null,null,null,null,null,null,null,null,null,null,null,null,null,null,null,null,null,null,null,null,null,null,null,null,null,null,null,null,null,null,"",{"$f":"IF(ISERROR(LARGE($J17:$BR17,BX$1)),\"\",LARGE($J17:$BR17,BX$1))","v":""},"","","","","","","","","","","","","",0]
[null,16,"Cees Jansen",0,0,0,0,null,0,null,null,null,null,null,null,null,null,null,null,null,null,null,null,null,null,null,null,null,null,null,null,null,null,null,null,null,null,null,null,null,null,null,null,null,null,null,null,null,null,null,null,null,null,null,null,null,null,null,null,null,null,null,null,null,null,null,null,null,null,null,null,null,null,null,"",{"$f":"IF(ISERROR(LARGE($J18:$BR18,BX$1)),\"\",LARGE($J18:$BR18,BX$1))","v":""},"","","","","","","","","","","","","",0]
[null,17,"Marly Paridaans",0,1,0,0,null,0,null,null,null,null,null,null,null,null,null,null,null,null,null,null,null,0,null,null,null,null,null,null,null,null,null,null,null,null,null,null,null,null,null,null,null,null,null,null,null,null,null,null,null,null,null,null,null,null,null,null,null,null,null,null,null,null,null,null,null,null,null,null,null,null,null,0,{"$f":"IF(ISERROR(LARGE($J19:$BR19,BX$1)),\"\",LARGE($J19:$BR19,BX$1))","v":""},"","","","","","","","","","","","","",0]
[null,18,"Daniëlle Dierckx",10,3,3.33,6,null,2,null,2,null,null,null,null,null,null,null,null,null,null,null,null,null,6,null,null,null,null,null,null,null,null,null,null,null,null,null,null,null,null,null,null,null,2,null,null,null,null,null,null,null,null,null,null,null,null,null,null,null,null,null,null,null,null,null,null,null,null,null,null,null,null,null,6,{"$f":"IF(ISERROR(LARGE($J20:$BR20,BX$1)),\"\",LARGE($J20:$BR20,BX$1))","v":2},2,"","","","","","","","","","","","",0]
{"$rows_left_out":23}
{"sheet":"standenlijst","index":1,"n_rows":41,"n_cols":14,"rows_kept":41,"cut":false,"hidden":false,"merged":[]}
["Stand","Nr","Naam Deelnemers","Aantal B15","Gem B15","Aantal Totaal","Gem Totaal","Beurten tot.","Gem B15 vjr","Gem B15 djr","Stijging tov vjr"]
[1,14,{"$f":"IF(ISERROR(VLOOKUP(B2,resultaten!$B$3:$CL$40,2,FALSE)),\"\",VLOOKUP(B2,resultaten!$B$3:$CL$40,2,FALSE))","v":"Bart de Laat"},{"$f":"IF(ISERROR(VLOOKUP(B2,resultaten!$B$3:$CL$41,89,FALSE)),0,VLOOKUP(B2,resultaten!$B$3:$CL$41,89,FALSE))","v":154},{"$f":"IF(D2=\"\",\"\",ROUND(D2/15,2))","v":10.27},{"$f":"IF(ISERROR(VLOOKUP($B2,resultaten!$B$3:$CL$41,3,FALSE)),0,VLOOKUP($B2,resultaten!$B$3:$CL$41,3,FALSE))","v":359},{"$f":"IF(ISERROR(VLOOKUP($B2,resultaten!$B$3:$CL$41,5,FALSE)),0,VLOOKUP($B2,resultaten!$B$3:$CL$41,5,FALSE))","v":7.33},{"$f":"IF(ISERROR(VLOOKUP($B2,resultaten!$B$3:$CL$41,4,FALSE)),0,VLOOKUP($B2,resultaten!$B$3:$CL$41,4,FALSE))","v":49},11.33,{"$f":"E2","v":10.27},{"$f":"IF(OR(I2=0,J2=0,J2<I2),\"\",J2-I2)","v":""}]
[2,11,{"$f":"IF(ISERROR(VLOOKUP(B3,resultaten!$B$3:$CL$40,2,FALSE)),\"\",VLOOKUP(B3,resultaten!$B$3:$CL$40,2,FALSE))","v":"Wim van Rooij"},{"$f":"IF(ISERROR(VLOOKUP(B3,resultaten!$B$3:$CL$41,89,FALSE)),0,VLOOKUP(B3,resultaten!$B$3:$CL$41,89,FALSE))","v":140},9.33,{"$f":"IF(ISERROR(VLOOKUP($B3,resultaten!$B$3:$CL$41,3,FALSE)),0,VLOOKUP($B3,resultaten!$B$3:$CL$41,3,FALSE))","v":266},{"$f":"IF(ISERROR(VLOOKUP($B3,resultaten!$B$3:$CL$41,5,FALSE)),0,VLOOKUP($B3,resultaten!$B$3:$CL$41,5,FALSE))","v":6.82},{"$f":"IF(ISERROR(VLOOKUP($B3,resultaten!$B$3:$CL$41,4,FALSE)),0,VLOOKUP($B3,resultaten!$B$3:$CL$41,4,FALSE))","v":39},9.6,9.33,""]
[3,1,{"$f":"IF(ISERROR(VLOOKUP(B4,resultaten!$B$3:$CL$40,2,FALSE)),\"\",VLOOKUP(B4,resultaten!$B$3:$CL$40,2,FALSE))","v":"Martien van Woerkum"},{"$f":"IF(ISERROR(VLOOKUP(B4,resultaten!$B$3:$CL$41,89,FALSE)),0,VLOOKUP(B4,resultaten!$B$3:$CL$41,89,FALSE))","v":135},9,{"$f":"IF(ISERROR(VLOOKUP($B4,resultaten!$B$3:$CL$41,3,FALSE)),0,VLOOKUP($B4,resultaten!$B$3:$CL$41,3,FALSE))","v":239},{"$f":"IF(ISERROR(VLOOKUP($B4,resultaten!$B$3:$CL$41,5,FALSE)),0,VLOOKUP($B4,resultaten!$B$3:$CL$41,5,FALSE))","v":6.46},{"$f":"IF(ISERROR(VLOOKUP($B4,resultaten!$B$3:$CL$41,4,FALSE)),0,VLOOKUP($B4,resultaten!$B$3:$CL$41,4,FALSE))","v":37},8.27,9,0.73000000000000043]
[4,4,{"$f":"IF(ISERROR(VLOOKUP(B5,resultaten!$B$3:$CL$40,2,FALSE)),\"\",VLOOKUP(B5,resultaten!$B$3:$CL$40,2,FALSE))","v":"Cees Brekelmans"},{"$f":"IF(ISERROR(VLOOKUP(B5,resultaten!$B$3:$CL$41,89,FALSE)),0,VLOOKUP(B5,resultaten!$B$3:$CL$41,89,FALSE))","v":129},8.6,{"$f":"IF(ISERROR(VLOOKUP($B5,resultaten!$B$3:$CL$41,3,FALSE)),0,VLOOKUP($B5,resultaten!$B$3:$CL$41,3,FALSE))","v":178},{"$f":"IF(ISERROR(VLOOKUP($B5,resultaten!$B$3:$CL$41,5,FALSE)),0,VLOOKUP($B5,resultaten!$B$3:$CL$41,5,FALSE))","v":7.12},{"$f":"IF(ISERROR(VLOOKUP($B5,resultaten!$B$3:$CL$41,4,FALSE)),0,VLOOKUP($B5,resultaten!$B$3:$CL$41,4,FALSE))","v":25},9.73,8.6,""]
[5,10,{"$f":"IF(ISERROR(VLOOKUP(B6,resultaten!$B$3:$CL$40,2,FALSE)),\"\",VLOOKUP(B6,resultaten!$B$3:$CL$40,2,FALSE))","v":"Jos Wouters"},{"$f":"IF(ISERROR(VLOOKUP(B6,resultaten!$B$3:$CL$41,89,FALSE)),0,VLOOKUP(B6,resultaten!$B$3:$CL$41,89,FALSE))","v":114},7.6,{"$f":"IF(ISERROR(VLOOKUP($B6,resultaten!$B$3:$CL$41,3,FALSE)),0,VLOOKUP($B6,resultaten!$B$3:$CL$41,3,FALSE))","v":200},{"$f":"IF(ISERROR(VLOOKUP($B6,resultaten!$B$3:$CL$41,5,FALSE)),0,VLOOKUP($B6,resultaten!$B$3:$CL$41,5,FALSE))","v":5.26},{"$f":"IF(ISERROR(VLOOKUP($B6,resultaten!$B$3:$CL$41,4,FALSE)),0,VLOOKUP($B6,resultaten!$B$3:$CL$41,4,FALSE))","v":38},8.27,7.6,""]
[6,2,{"$f":"IF(ISERROR(VLOOKUP(B7,resultaten!$B$3:$CL$40,2,FALSE)),\"\",VLOOKUP(B7,resultaten!$B$3:$CL$40,2,FALSE))","v":"Jack de Graaf"},{"$f":"IF(ISERROR(VLOOKUP(B7,resultaten!$B$3:$CL$41,89,FALSE)),0,VLOOKUP(B7,resultaten!$B$3:$CL$41,89,FALSE))","v":103},6.87,{"$f":"IF(ISERROR(VLOOKUP($B7,resultaten!$B$3:$CL$41,3,FALSE)),0,VLOOKUP($B7,resultaten!$B$3:$CL$41,3,FALSE))","v":157},{"$f":"IF(ISERROR(VLOOKUP($B7,resultaten!$B$3:$CL$41,5,FALSE)),0,VLOOKUP($B7,resultaten!$B$3:$CL$41,5,FALSE))","v":5.41},{"$f":"IF(ISERROR(VLOOKUP($B7,resultaten!$B$3:$CL$41,4,FALSE)),0,VLOOKUP($B7,resultaten!$B$3:$CL$41,4,FALSE))","v":29},6.93,6.87,""]
[7,5,{"$f":"IF(ISERROR(VLOOKUP(B8,resultaten!$B$3:$CL$40,2,FALSE)),\"\",VLOOKUP(B8,resultaten!$B$3:$CL$40,2,FALSE))","v":"Christ van Dongen"},{"$f":"IF(ISERROR(VLOOKUP(B8,resultaten!$B$3:$CL$41,89,FALSE)),0,VLOOKUP(B8,resultaten!$B$3:$CL$41,89,FALSE))","v":65},4.33,{"$f":"IF(ISERROR(VLOOKUP($B8,resultaten!$B$3:$CL$41,3,FALSE)),0,VLOOKUP($B8,resultaten!$B$3:$CL$41,3,FALSE))","v":75},{"$f":"IF(ISERROR(VLOOKUP($B8,resultaten!$B$3:$CL$41,5,FALSE)),0,VLOOKUP($B8,resultaten!$B$3:$CL$41,5,FALSE))","v":3.57},{"$f":"IF(ISERROR(VLOOKUP($B8,resultaten!$B$3:$CL$41,4,FALSE)),0,VLOOKUP($B8,resultaten!$B$3:$CL$41,4,FALSE))","v":21},4.67,4.33,"",null,null,"Om de standenlijst te sorteren druk op boventaande knop!"]
[8,9,{"$f":"IF(ISERROR(VLOOKUP(B9,resultaten!$B$3:$CL$40,2,FALSE)),\"\",VLOOKUP(B9,resultaten!$B$3:$CL$40,2,FALSE))","v":"Gust Gijbels"},{"$f":"IF(ISERROR(VLOOKUP(B9,resultaten!$B$3:$CL$41,89,FALSE)),0,VLOOKUP(B9,resultaten!$B$3:$CL$41,89,FALSE))","v":0},0,{"$f":"IF(ISERROR(VLOOKUP($B9,resultaten!$B$3:$CL$41,3,FALSE)),0,VLOOKUP($B9,resultaten!$B$3:$CL$41,3,FALSE))","v":93},{"$f":"IF(ISERROR(VLOOKUP($B9,resultaten!$B$3:$CL$41,5,FALSE)),0,VLOOKUP($B9,resultaten!$B$3:$CL$41,5,FALSE))","v":9.3000000000000007},{"$f":"IF(ISERROR(VLOOKUP($B9,resultaten!$B$3:$CL$41,4,FALSE)),0,VLOOKUP($B9,resultaten!$B$3:$CL$41,4,FALSE))","v":10},10.199999999999999,0,""]
[9,13,{"$f":"IF(ISERROR(VLOOKUP(B10,resultaten!$B$3:$CL$40,2,FALSE)),\"\",VLOOKUP(B10,resultaten!$B$3:$CL$40,2,FALSE))","v":"Olav Kruijssen"},{"$f":"IF(ISERROR(VLOOKUP(B10,resultaten!$B$3:$CL$41,89,FALSE)),0,VLOOKUP(B10,resultaten!$B$3:$CL$41,89,FALSE))","v":0},0,{"$f":"IF(ISERROR(VLOOKUP($B10,resultaten!$B$3:$CL$41,3,FALSE)),0,VLOOKUP($B10,resultaten!$B$3:$CL$41,3,FALSE))","v":9},{"$f":"IF(ISERROR(VLOOKUP($B10,resultaten!$B$3:$CL$41,5,FALSE)),0,VLOOKUP($B10,resultaten!$B$3:$CL$41,5,FALSE))","v":9},{"$f":"IF(ISERROR(VLOOKUP($B10,resultaten!$B$3:$CL$41,4,FALSE)),0,VLOOKUP($B10,resultaten!$B$3:$CL$41,4,FALSE))","v":1},0,0,""]
[10,3,{"$f":"IF(ISERROR(VLOOKUP(B11,resultaten!$B$3:$CL$40,2,FALSE)),\"\",VLOOKUP(B11,resultaten!$B$3:$CL$40,2,FALSE))","v":"Nico Borgmans"},{"$f":"IF(ISERROR(VLOOKUP(B11,resultaten!$B$3:$CL$41,89,FALSE)),0,VLOOKUP(B11,resultaten!$B$3:$CL$41,89,FALSE))","v":0},0,{"$f":"IF(ISERROR(VLOOKUP($B11,resultaten!$B$3:$CL$41,3,FALSE)),0,VLOOKUP($B11,resultaten!$B$3:$CL$41,3,FALSE))","v":13},{"$f":"IF(ISERROR(VLOOKUP($B11,resultaten!$B$3:$CL$41,5,FALSE)),0,VLOOKUP($B11,resultaten!$B$3:$CL$41,5,FALSE))","v":6.5},{"$f":"IF(ISERROR(VLOOKUP($B11,resultaten!$B$3:$CL$41,4,FALSE)),0,VLOOKUP($B11,resultaten!$B$3:$CL$41,4,FALSE))","v":2},0,0,""]
[11,8,{"$f":"IF(ISERROR(VLOOKUP(B12,resultaten!$B$3:$CL$40,2,FALSE)),\"\",VLOOKUP(B12,resultaten!$B$3:$CL$40,2,FALSE))","v":"Dave Geysen"},{"$f":"IF(ISERROR(VLOOKUP(B12,resultaten!$B$3:$CL$41,89,FALSE)),0,VLOOKUP(B12,resultaten!$B$3:$CL$41,89,FALSE))","v":0},0,{"$f":"IF(ISERROR(VLOOKUP($B12,resultaten!$B$3:$CL$41,3,FALSE)),0,VLOOKUP($B12,resultaten!$B$3:$CL$41,3,FALSE))","v":5},{"$f":"IF(ISERROR(VLOOKUP($B12,resultaten!$B$3:$CL$41,5,FALSE)),0,VLOOKUP($B12,resultaten!$B$3:$CL$41,5,FALSE))","v":5},{"$f":"IF(ISERROR(VLOOKUP($B12,resultaten!$B$3:$CL$41,4,FALSE)),0,VLOOKUP($B12,resultaten!$B$3:$CL$41,4,FALSE))","v":1},0,0,""]
[12,7,{"$f":"IF(ISERROR(VLOOKUP(B13,resultaten!$B$3:$CL$40,2,FALSE)),\"\",VLOOKUP(B13,resultaten!$B$3:$CL$40,2,FALSE))","v":"Jeroen van Dongen"},{"$f":"IF(ISERROR(VLOOKUP(B13,resultaten!$B$3:$CL$41,89,FALSE)),\"\",VLOOKUP(B13,resultaten!$B$3:$CL$41,89,FALSE))","v":0},0,{"$f":"IF(ISERROR(VLOOKUP($B13,resultaten!$B$3:$CL$41,3,FALSE)),\"\",VLOOKUP($B13,resultaten!$B$3:$CL$41,3,FALSE))","v":12},{"$f":"IF(ISERROR(VLOOKUP($B13,resultaten!$B$3:$CL$41,5,FALSE)),\"\",VLOOKUP($B13,resultaten!$B$3:$CL$41,5,FALSE))","v":4},{"$f":"IF(ISERROR(VLOOKUP($B13,resultaten!$B$3:$CL$41,4,FALSE)),\"\",VLOOKUP($B13,resultaten!$B$3:$CL$41,4,FALSE))","v":3},0,0,""]
[13,19,{"$f":"IF(ISERROR(VLOOKUP(B14,resultaten!$B$3:$CL$40,2,FALSE)),\"\",VLOOKUP(B14,resultaten!$B$3:$CL$40,2,FALSE))","v":"Marcel Paridaans"},{"$f":"IF(ISERROR(VLOOKUP(B14,resultaten!$B$3:$CL$41,89,FALSE)),0,VLOOKUP(B14,resultaten!$B$3:$CL$41,89,FALSE))","v":0},0,{"$f":"IF(ISERROR(VLOOKUP($B14,resultaten!$B$3:$CL$41,3,FALSE)),0,VLOOKUP($B14,resultaten!$B$3:$CL$41,3,FALSE))","v":44},{"$f":"IF(ISERROR(VLOOKUP($B14,resultaten!$B$3:$CL$41,5,FALSE)),0,VLOOKUP($B14,resultaten!$B$3:$CL$41,5,FALSE))","v":3.38},{"$f":"IF(ISERROR(VLOOKUP($B14,resultaten!$B$3:$CL$41,4,FALSE)),0,VLOOKUP($B14,resultaten!$B$3:$CL$41,4,FALSE))","v":13},3.93,0,""]
[14,18,{"$f":"IF(ISERROR(VLOOKUP(B15,resultaten!$B$3:$CL$40,2,FALSE)),\"\",VLOOKUP(B15,resultaten!$B$3:$CL$40,2,FALSE))","v":"Daniëlle Dierckx"},{"$f":"IF(ISERROR(VLOOKUP(B15,resultaten!$B$3:$CL$41,89,FALSE)),0,VLOOKUP(B15,resultaten!$B$3:$CL$41,89,FALSE))","v":0},0,{"$f":"IF(ISERROR(VLOOKUP($B15,resultaten!$B$3:$CL$41,3,FALSE)),0,VLOOKUP($B15,resultaten!$B$3:$CL$41,3,FALSE))","v":10},{"$f":"IF(ISERROR(VLOOKUP($B15,resultaten!$B$3:$CL$41,5,FALSE)),0,VLOOKUP($B15,resultaten!$B$3:$CL$41,5,FALSE))","v":3.33},{"$f":"IF(ISERROR(VLOOKUP($B15,resultaten!$B$3:$CL$41,4,FALSE)),0,VLOOKUP($B15,resultaten!$B$3:$CL$41,4,FALSE))","v":3},0,0,""]
[15,22,{"$f":"IF(ISERROR(VLOOKUP(B16,resultaten!$B$3:$CL$40,2,FALSE)),\"\",VLOOKUP(B16,resultaten!$B$3:$CL$40,2,FALSE))","v":0},{"$f":"IF(ISERROR(VLOOKUP(B16,resultaten!$B$3:$CL$41,89,FALSE)),0,VLOOKUP(B16,resultaten!$B$3:$CL$41,89,FALSE))","v":0},0,{"$f":"IF(ISERROR(VLOOKUP($B16,resultaten!$B$3:$CL$41,3,FALSE)),0,VLOOKUP($B16,resultaten!$B$3:$CL$41,3,FALSE))","v":0},{"$f":"IF(ISERROR(VLOOKUP($B16,resultaten!$B$3:$CL$41,5,FALSE)),0,VLOOKUP($B16,resultaten!$B$3:$CL$41,5,FALSE))","v":0},{"$f":"IF(ISERROR(VLOOKUP($B16,resultaten!$B$3:$CL$41,4,FALSE)),0,VLOOKUP($B16,resultaten!$B$3:$CL$41,4,FALSE))","v":0},0,0,""]
[16,23,{"$f":"IF(ISERROR(VLOOKUP(B17,resultaten!$B$3:$CL$40,2,FALSE)),\"\",VLOOKUP(B17,resultaten!$B$3:$CL$40,2,FALSE))","v":0},{"$f":"IF(ISERROR(VLOOKUP(B17,resultaten!$B$3:$CL$41,89,FALSE)),0,VLOOKUP(B17,resultaten!$B$3:$CL$41,89,FALSE))","v":0},0,{"$f":"IF(ISERROR(VLOOKUP($B17,resultaten!$B$3:$CL$41,3,FALSE)),0,VLOOKUP($B17,resultaten!$B$3:$CL$41,3,FALSE))","v":0},{"$f":"IF(ISERROR(VLOOKUP($B17,resultaten!$B$3:$CL$41,5,FALSE)),0,VLOOKUP($B17,resultaten!$B$3:$CL$41,5,FALSE))","v":0},{"$f":"IF(ISERROR(VLOOKUP($B17,resultaten!$B$3:$CL$41,4,FALSE)),0,VLOOKUP($B17,resultaten!$B$3:$CL$41,4,FALSE))","v":0},0,0,""]
[17,24,{"$f":"IF(ISERROR(VLOOKUP(B18,resultaten!$B$3:$CL$40,2,FALSE)),\"\",VLOOKUP(B18,resultaten!$B$3:$CL$40,2,FALSE))","v":0},{"$f":"IF(ISERROR(VLOOKUP(B18,resultaten!$B$3:$CL$41,89,FALSE)),0,VLOOKUP(B18,resultaten!$B$3:$CL$41,89,FALSE))","v":0},0,{"$f":"IF(ISERROR(VLOOKUP($B18,resultaten!$B$3:$CL$41,3,FALSE)),0,VLOOKUP($B18,resultaten!$B$3:$CL$41,3,FALSE))","v":0},{"$f":"IF(ISERROR(VLOOKUP($B18,resultaten!$B$3:$CL$41,5,FALSE)),0,VLOOKUP($B18,resultaten!$B$3:$CL$41,5,FALSE))","v":0},{"$f":"IF(ISERROR(VLOOKUP($B18,resultaten!$B$3:$CL$41,4,FALSE)),0,VLOOKUP($B18,resultaten!$B$3:$CL$41,4,FALSE))","v":0},0,0,""]
[18,21,{"$f":"IF(ISERROR(VLOOKUP(B19,resultaten!$B$3:$CL$40,2,FALSE)),\"\",VLOOKUP(B19,resultaten!$B$3:$CL$40,2,FALSE))","v":0},{"$f":"IF(ISERROR(VLOOKUP(B19,resultaten!$B$3:$CL$41,89,FALSE)),0,VLOOKUP(B19,resultaten!$B$3:$CL$41,89,FALSE))","v":0},0,{"$f":"IF(ISERROR(VLOOKUP($B19,resultaten!$B$3:$CL$41,3,FALSE)),0,VLOOKUP($B19,resultaten!$B$3:$CL$41,3,FALSE))","v":0},{"$f":"IF(ISERROR(VLOOKUP($B19,resultaten!$B$3:$CL$41,5,FALSE)),0,VLOOKUP($B19,resultaten!$B$3:$CL$41,5,FALSE))","v":0},{"$f":"IF(ISERROR(VLOOKUP($B19,resultaten!$B$3:$CL$41,4,FALSE)),0,VLOOKUP($B19,resultaten!$B$3:$CL$41,4,FALSE))","v":0},0,0,""]
[19,30,{"$f":"IF(ISERROR(VLOOKUP(B20,resultaten!$B$3:$CL$40,2,FALSE)),\"\",VLOOKUP(B20,resultaten!$B$3:$CL$40,2,FALSE))","v":0},{"$f":"IF(ISERROR(VLOOKUP(B20,resultaten!$B$3:$CL$41,89,FALSE)),0,VLOOKUP(B20,resultaten!$B$3:$CL$41,89,FALSE))","v":0},0,{"$f":"IF(ISERROR(VLOOKUP($B20,resultaten!$B$3:$CL$41,3,FALSE)),0,VLOOKUP($B20,resultaten!$B$3:$CL$41,3,FALSE))","v":0},{"$f":"IF(ISERROR(VLOOKUP($B20,resultaten!$B$3:$CL$41,5,FALSE)),0,VLOOKUP($B20,resultaten!$B$3:$CL$41,5,FALSE))","v":0},{"$f":"IF(ISERROR(VLOOKUP($B20,resultaten!$B$3:$CL$41,4,FALSE)),0,VLOOKUP($B20,resultaten!$B$3:$CL$41,4,FALSE))","v":0},0,0]
{"$rows_left_out":22}
{"sheet":"deelnemers","index":2,"n_rows":41,"n_cols":2,"rows_kept":41,"cut":false,"hidden":false,"merged":[]}
["Nr.","Naam"]
[1,"Martien van Woerkum"]
[2,"Jack de Graaf"]
[3,"Nico Borgmans"]
[4,"Cees Brekelmans"]
[5,"Christ van Dongen"]
[6,"Ingrid van Dongen"]
[7,"Jeroen van Dongen"]
[8,"Dave Geysen"]
[9,"Gust Gijbels"]
[10,"Jos Wouters"]
[11,"Wim van Rooij"]
[12,"Harry Kloppenburg"]
[13,"Olav Kruijssen"]
[14,"Bart de Laat"]
[15,"Sjaan Paridaans"]
[16,"Cees Jansen"]
[17,"Marly Paridaans"]
[18,"Daniëlle Dierckx"]
[19,"Marcel Paridaans"]
{"$rows_left_out":22}
{"sheet":"print.kopieren speciaal!!","index":3,"n_rows":1,"n_cols":11,"rows_kept":1,"cut":false,"hidden":false,"merged":[]}
["Nr","Naam Deelnemers","Stand","Aantal B15","Gem B15","Aantal Totaal","Gem Totaal","Beurten tot.","Tussenstand","Hoog","Laag"]

{"sheet":"uitleg","index":4,"n_rows":25,"n_cols":5,"rows_kept":25,"cut":false,"hidden":false,"merged":[]}
[]
["a","Vul alleen de gemarkeerde velden in !!"]
[null,"Begin in blad Deelnemers met de namen. Deze worden overgenomen"]
[null,"in het blad Resultaten. De totalen van Resultaten, worden weer opgenomen"]
[null,"in blad Deelnemers. Let op NIET sorteren!!!"]
[null,"Bij de eerste beurt de NUL overschrijven."]
[null,"De STAND in blad Deelnemers wordt pas berekend na 15 beurten!!"]
[null,"De Tussenstand en de Stand worden voor alle deelnemers weergegeven, dus ook voor "]
[null,"de deelnemers met 0 beurten.",null,null,"Let op Niet sorteren!!!"]
[]
["b","Voor printen totaallijst kopieer blad deelnemers naar blad Print.kopieren speciaal"]
[null,"Kies daar voor WAARDEN."]
[null,"Hierna kan gesorteerd worden op alle aanwezige kolommen."]
[null,"Sorteer bijvoorbeeld op STAND. Veldnaamrij!!!"]
[null,"etc."]
[]
["c","Leegmaken blad Resultaten."]
[null,"Selecteer alle gemarkeerde gevulde cellen."]
[null,"Kies Bewerken, in dit menu Kies GA NAAR, in dit menu Kies SPECIAAL,"]
[null,"vervolgens ZICHTBARE CELLEN, bevestig dit en Druk DELete."]
{"$rows_left_out":5}